Target
Histone deacetylase 1
Ligand
BDBM413916
Substrate
Meas. Tech.
Reporter Displacement Assay
Kd
300±n/a nM
Citation
 Jefson, MRLowe, III, JADey, FBergmann, ASchoop, A Heterobicyclic N-aminophenyl-amides as inhibitors of histone deacetylase US Patent  US10421756 Publication Date 9/24/2019 
Target
Name:
Histone deacetylase 1
Synonyms:
Cereblon/Histone deacetylase 1 HDAC1 Histone deacetylase 1 (HDAC1) RPD3L1
Type:
Enzyme
Mol. Mass.:
55090.27
Organism:
Homo sapiens (Human)
Description:
Q13547
Residue:
482
  
Inhibitor
Name:
BDBM413916
Synonyms:
US10421756, Compound 100
Type:
Small organic molecule
Emp. Form.:
C18H16N6O
Mol. Mass.:
332.3592
SMILES:
Nc1ccc(cc1NC(=O)N1Cc2cncnc2C1)-c1ccncc1
: