Target
Histone deacetylase 2
Ligand
BDBM413962
Substrate
Meas. Tech.
Reporter Displacement Assay
Kd
2750±n/a nM
Citation
 Jefson, MRLowe, III, JADey, FBergmann, ASchoop, A Heterobicyclic N-aminophenyl-amides as inhibitors of histone deacetylase US Patent  US10421756 Publication Date 9/24/2019 
Target
Name:
Histone deacetylase 2
Synonyms:
Cereblon/Histone deacetylase 2 HDAC2 Histone deacetylase 2 (HDAC2) | Human HDAC2
Type:
Chromatin regulator; hydrolase; repressor
Mol. Mass.:
55356.54
Organism:
Homo sapiens (Human)
Description:
Q92769
Residue:
488
  
Inhibitor
Name:
BDBM413962
Synonyms:
US10421756, Compound 146
Type:
Small organic molecule
Emp. Form.:
C19H17N5O
Mol. Mass.:
331.3712
SMILES:
Nc1ccc(cc1NC(=O)N1Cc2ccncc2C1)-c1ccccn1
: