Target
Histone deacetylase 1
Ligand
BDBM413964
Substrate
Meas. Tech.
Reporter Displacement Assay
Kd
2750±n/a nM
Citation
 Jefson, MRLowe, III, JADey, FBergmann, ASchoop, A Heterobicyclic N-aminophenyl-amides as inhibitors of histone deacetylase US Patent  US10421756 Publication Date 9/24/2019 
Target
Name:
Histone deacetylase 1
Synonyms:
Cereblon/Histone deacetylase 1 HDAC1 Histone deacetylase 1 (HDAC1) RPD3L1
Type:
Enzyme
Mol. Mass.:
55090.27
Organism:
Homo sapiens (Human)
Description:
Q13547
Residue:
482
  
Inhibitor
Name:
BDBM413964
Synonyms:
US10421756, Compound 148
Type:
Small organic molecule
Emp. Form.:
C20H22FN3O2
Mol. Mass.:
355.406
SMILES:
Nc1ccc(cc1NC(=O)N1CC2(C1)CCOCC2)-c1ccc(F)cc1
: