Target
Histone deacetylase 2
Ligand
BDBM413975
Substrate
Meas. Tech.
Reporter Displacement Assay
Kd
300±n/a nM
Citation
 Jefson, MRLowe, III, JADey, FBergmann, ASchoop, A Heterobicyclic N-aminophenyl-amides as inhibitors of histone deacetylase US Patent  US10421756 Publication Date 9/24/2019 
Target
Name:
Histone deacetylase 2
Synonyms:
Cereblon/Histone deacetylase 2 HDAC2 Histone deacetylase 2 (HDAC2) | Human HDAC2
Type:
Chromatin regulator; hydrolase; repressor
Mol. Mass.:
55356.54
Organism:
Homo sapiens (Human)
Description:
Q92769
Residue:
488
  
Inhibitor
Name:
BDBM413975
Synonyms:
US10421756, Compound 159
Type:
Small organic molecule
Emp. Form.:
C24H27FN4O3
Mol. Mass.:
438.4946
SMILES:
Nc1ccc(cc1NC(=O)N1CC2CN(CC2C1)C(=O)OC1CCC1)-c1ccc(F)cc1
: