Target
Tyrosine-protein kinase JAK3
Ligand
BDBM413994
Substrate
Meas. Tech.
Kinase-Inhibiting Activity Assay
IC50
<0.300±n/a nM
Citation
 Nakamura, MYamanaka, HMitsuya, MHarada, T Pyrrolo[2,3-d]pyrimidine compound or salt thereof US Patent  US10421760 Publication Date 9/24/2019 
Target
Name:
Tyrosine-protein kinase JAK3
Synonyms:
JAK-3 JAK3_HUMAN Janus kinase 3 (JAK3) L-JAK | Leukocyte janus kinase
Type:
Protein
Mol. Mass.:
125111.08
Organism:
Homo sapiens (Human)
Description:
P52333
Residue:
1124
  
Inhibitor
Name:
BDBM413994
Synonyms:
US10421760, Compound 3
Type:
Small organic molecule
Emp. Form.:
C19H18N4OS
Mol. Mass.:
350.437
SMILES:
C=CC(=O)NC1CCC=C(C1)c1ncnc2[nH]cc(-c3ccsc3)c12
: