Target
Tyrosine-protein kinase JAK2
Ligand
BDBM414000
Substrate
Meas. Tech.
Kinase-Inhibiting Activity Assay
IC50
660±n/a nM
Citation
 Nakamura, MYamanaka, HMitsuya, MHarada, T Pyrrolo[2,3-d]pyrimidine compound or salt thereof US Patent  US10421760 Publication Date 9/24/2019 
Target
Name:
Tyrosine-protein kinase JAK2
Synonyms:
JAK-2 JAK2_HUMAN Janus kinase 2 (JAK2) | Janus kinase 2 (a protein tyrosine kinase)
Type:
Protein
Mol. Mass.:
130684.68
Organism:
Homo sapiens (Human)
Description:
O60674
Residue:
1132
  
Inhibitor
Name:
BDBM414000
Synonyms:
US10421760, Compound 10
Type:
Small organic molecule
Emp. Form.:
C20H18N4O
Mol. Mass.:
330.3831
SMILES:
C=CC(=O)NC1CCC(=C1)c1ncnc2[nH]cc(-c3ccccc3)c12
: