Target
Tyrosine-protein kinase ITK/TSK
Ligand
BDBM295013
Substrate
Meas. Tech.
In Vitro Inhibitory Activities on ITK
IC50
>1000±n/a nM
Citation
 Han, YZhu, LXiao, DPeng, YLuo, H Inhibitor of bruton's tyrosine kinase US Patent  US10112922 Publication Date 10/30/2018 
Target
Name:
Tyrosine-protein kinase ITK/TSK
Synonyms:
EMT ITK_HUMAN LYK Tyrosine-protein kinase ITK Tyrosine-protein kinase Lyk
Type:
Protein
Mol. Mass.:
71839.20
Organism:
Homo sapiens (Human)
Description:
Q08881
Residue:
620
  
Inhibitor
Name:
BDBM295013
Synonyms:
US10112922, Compound 3
Type:
Small organic molecule
Emp. Form.:
C26H30N6O3
Mol. Mass.:
474.5548
SMILES:
CN(C)C\C=C\C(=O)N1CC[C@H](C1)n1nc(c(C(N)=O)c1N)-c1ccc(Oc2ccccc2)cc1
: