Target
Tyrosine-protein kinase BTK
Ligand
BDBM295021
Substrate
Meas. Tech.
In Vitro Inhibitory Activities on BTK
pH
7.4±n/a
IC50
<100.0±n/a nM
Comments
extracted
Citation
 Han, YZhu, LXiao, DPeng, YLuo, H Inhibitor of bruton's tyrosine kinase US Patent  US10112922 Publication Date 10/30/2018 
Target
Name:
Tyrosine-protein kinase BTK
Synonyms:
AGMX1 Agammaglobulinaemia tyrosine kinase B cell progenitor kinase BPK BTK_HUMAN Tyrosine Kinase BTK Tyrosine-protein kinase BTK (BTK)
Type:
Enzyme
Mol. Mass.:
76289.95
Organism:
Homo sapiens (Human)
Description:
Q06187
Residue:
659
  
Inhibitor
Name:
BDBM295021
Synonyms:
US10112922, Compound 11
Type:
Small organic molecule
Emp. Form.:
C24H23N5O5
Mol. Mass.:
461.4699
SMILES:
NC(=O)c1c(N)n(nc1-c1ccc(Oc2ccccc2)cc1)[C@@H]1CCN(C1)C(=O)\C=C/C(O)=O
: