Target
ATR-interacting protein/Serine/threonine-protein kinase ATR
Ligand
BDBM414029
Substrate
Meas. Tech.
Enzymatic Assay
IC50
420±n/a nM
Citation
 Di Francesco, MEJones, PCarroll, CLCross, JBJohnson, MGLively, S Tetrahydropyrido[4,3-d]pyrimidine inhibitors of ATR kinase US Patent  US10421765 Publication Date 9/24/2019 
Target
Name:
ATR-interacting protein/Serine/threonine-protein kinase ATR
Synonyms:
ATR/ATRIP
Type:
Enzyme
Mol. Mass.:
Description:
Components:
This complex has 2 components.
Component 1
Name:
Serine/threonine-protein kinase ATR
Synonyms:
ATR Ataxia telangiectasia and Rad3-related protein (ATR) FRP1 | Serine-protein kinase ATR
Type:
Protein
Mol. Mass.:
301404.58
Organism:
Homo sapiens (Human)
Description:
Q13535
Residue:
2644
  
Component 2
Name:
ATR-interacting protein
Synonyms:
AGS1 ATR-interacting protein (ATRIP) ATRIP_HUMAN
Type:
Enzyme Catalytic Domain
Mol. Mass.:
85833.30
Organism:
Homo sapiens (Human)
Description:
Q8WXE1
Residue:
791
  
Inhibitor
Name:
BDBM414029
Synonyms:
3-methanesulfonyl-1- [(7R)-7-methyl-6-{1H- pyrrolo[2,3-b]pyridin-4- yl}-5H,6H,7H,8H- pyrido[4,3-d]pyrimidin-4- yl]piperidine US10745420, Example 18
Type:
Small organic molecule
Emp. Form.:
C21H26N6O2S
Mol. Mass.:
426.535
SMILES:
C[C@@H]1Cc2ncnc(N3CCCC(C3)S(C)(=O)=O)c2CN1c1ccnc2[nH]ccc12
: