Target
ATR-interacting protein/Serine/threonine-protein kinase ATR
Ligand
BDBM414044
Substrate
Meas. Tech.
Enzymatic Assay
IC50
183±n/a nM
Citation
 Di Francesco, MEJones, PCarroll, CLCross, JBJohnson, MGLively, S Tetrahydropyrido[4,3-d]pyrimidine inhibitors of ATR kinase US Patent  US10421765 Publication Date 9/24/2019 
Target
Name:
ATR-interacting protein/Serine/threonine-protein kinase ATR
Synonyms:
ATR/ATRIP
Type:
Enzyme
Mol. Mass.:
Description:
Components:
This complex has 2 components.
Component 1
Name:
Serine/threonine-protein kinase ATR
Synonyms:
ATR Ataxia telangiectasia and Rad3-related protein (ATR) FRP1 | Serine-protein kinase ATR
Type:
Protein
Mol. Mass.:
301404.58
Organism:
Homo sapiens (Human)
Description:
Q13535
Residue:
2644
  
Component 2
Name:
ATR-interacting protein
Synonyms:
AGS1 ATR-interacting protein (ATRIP) ATRIP_HUMAN
Type:
Enzyme Catalytic Domain
Mol. Mass.:
85833.30
Organism:
Homo sapiens (Human)
Description:
Q8WXE1
Residue:
791
  
Inhibitor
Name:
BDBM414044
Synonyms:
2-{1-[(7R)-6-{6-chloro- 1H-pyrrolo[2,3-b]pyridin- 4-yl}-7-methyl- 5H,6H,7H,8H-pyrido[4,3- d]pyrimidin-4- yl]azetidin-3-yl}propan- 2-ol US10745420, Example 33
Type:
Small organic molecule
Emp. Form.:
C21H25ClN6O
Mol. Mass.:
412.916
SMILES:
C[C@@H]1Cc2ncnc(N3CC(C3)C(C)(C)O)c2CN1c1cc(Cl)nc2[nH]ccc12
: