Target
ATR-interacting protein/Serine/threonine-protein kinase ATR
Ligand
BDBM414108
Substrate
Meas. Tech.
Enzymatic Assay
IC50
270±n/a nM
Citation
 Di Francesco, MEJones, PCarroll, CLCross, JBJohnson, MGLively, S Tetrahydropyrido[4,3-d]pyrimidine inhibitors of ATR kinase US Patent  US10421765 Publication Date 9/24/2019 
Target
Name:
ATR-interacting protein/Serine/threonine-protein kinase ATR
Synonyms:
ATR/ATRIP
Type:
Enzyme
Mol. Mass.:
Description:
Components:
This complex has 2 components.
Component 1
Name:
Serine/threonine-protein kinase ATR
Synonyms:
ATR Ataxia telangiectasia and Rad3-related protein (ATR) FRP1 | Serine-protein kinase ATR
Type:
Protein
Mol. Mass.:
301404.58
Organism:
Homo sapiens (Human)
Description:
Q13535
Residue:
2644
  
Component 2
Name:
ATR-interacting protein
Synonyms:
AGS1 ATR-interacting protein (ATRIP) ATRIP_HUMAN
Type:
Enzyme Catalytic Domain
Mol. Mass.:
85833.30
Organism:
Homo sapiens (Human)
Description:
Q8WXE1
Residue:
791
  
Inhibitor
Name:
BDBM414108
Synonyms:
(R)-6-(6-cyclopropyl-1H- pyrrolo[2,3-b]pyridin-4- yl)-7-methyl-4-(1- (methylsulfonyl)- piperidin-4-yl)-5,6,7,8- tetrahydropyrido[4,3-d]- pyrimidine US10745420, Example 95
Type:
Small organic molecule
Emp. Form.:
C24H30N6O2S
Mol. Mass.:
466.599
SMILES:
C[C@@H]1Cc2ncnc(C3CCN(CC3)S(C)(=O)=O)c2CN1c1cc(nc2[nH]ccc12)C1CC1
: