Target
Fatty-acid amide hydrolase 1
Ligand
BDBM359720
Substrate
Meas. Tech.
In Vitro Human FAAH Fluorescent Assay
IC50
2.90±n/a nM
Citation
 Piomelli, DBandiera, TScarpelli, R Inhibitors of fatty acid amide hydrolase (FAAH) enzyme with improved oral bioavailability and their use as medicaments US Patent  US10435355 Publication Date 10/8/2019 
Target
Name:
Fatty-acid amide hydrolase 1
Synonyms:
Anandamide amidohydrolase FAAH FAAH1_HUMAN Fatty-acid amide hydrolase (FAAH) Oleamide hydrolase 1
Type:
Protein
Mol. Mass.:
63071.19
Organism:
Homo sapiens (Human)
Description:
O00519
Residue:
579
  
Inhibitor
Name:
BDBM359720
Synonyms:
US10435355, Example 4 [4-fluoro-3-[3- (methylcarbamoyl)phenyl] phenyl]N- cyclopentylcarbamate
Type:
Small organic molecule
Emp. Form.:
C20H21FN2O3
Mol. Mass.:
356.3907
SMILES:
CNC(=O)c1cccc(c1)-c1cc(OC(=O)NC2CCCC2)ccc1F
: