Target
Nuclear receptor ROR-gamma
Ligand
BDBM414358
Substrate
Meas. Tech.
General RORgamma Gal4 Reporter Assay
IC50
2.00±n/a nM
Citation
 Marcoux, DBeaudoin Bertrand, MDhar, TGYang, MGXiao, ZXiao, HZhu, YWeigelt, CABatt, DG Tricyclic sulfones as ROR gamma modulators US Patent  US10435369 Publication Date 10/8/2019 
Target
Name:
Nuclear receptor ROR-gamma
Synonyms:
NR1F3 Nuclear receptor ROR-gamma (RORC) RAR-related orphan receptor C (RORc) RORG RZRG Retinoid-related orphan receptor-gamma (RORc)
Type:
Enzyme Catalytic Domain
Mol. Mass.:
58218.40
Organism:
Homo sapiens (Human)
Description:
P51449
Residue:
518
  
Inhibitor
Name:
BDBM414358
Synonyms:
1-(acetyl-d3)-N-((3R,3aS,9bS)-9b-((4-fluorophenyl)sulfonyl)-7-(perfluoropropan-2-)-2,3,3a,4,5,9b-hexahydro-1H-cyclopenta[a]naphthalen-3-yl)-4-hydroxypiperidine-4-carboxamide | US10435369, Example 245
Type:
Small organic molecule
Emp. Form.:
C30H30F8N2O5S
Mol. Mass.:
682.622
SMILES:
CC(=O)N1CCC(O)(CC1)C(=O)N[C@@H]1CC[C@@]2([C@H]1CCc1cc(ccc21)C(F)(C(F)(F)F)C(F)(F)F)S(=O)(=O)c1ccc(F)cc1
: