Target
Epidermal growth factor receptor
Ligand
BDBM149405
Substrate
Meas. Tech.
Omnia Assay Protocol for Potency Assessment Against EGFR (WT) and EGFR (T790M/L858R) Active Enzymes
IC50
20.0±n/a nM
Citation
 Lee, KNiu, DPetter, RCBaevsky, MFSingh, J Heterocyclic compounds and uses thereof US Patent  US10434101 Publication Date 10/8/2019 
Target
Name:
Epidermal growth factor receptor
Synonyms:
EGF Receptor Substrate EGFR_HUMAN ERBB1 Epidermal Growth Factor Receptor erbB-1 Epidermal growth factor receptor (EGFR) HER1 Proto-oncogene c-ErbB-1 Tyrosine-Protein Kinase ErbB-1
Type:
Receptor Kinase Domain
Mol. Mass.:
134279.59
Organism:
Homo sapiens (Human)
Description:
P00533
Residue:
1210
  
Inhibitor
Name:
BDBM149405
Synonyms:
US10434101, Compound I-5 US8975249, I-15 | US8975249, I-5
Type:
Small organic molecule
Emp. Form.:
C24H24ClN5O4
Mol. Mass.:
481.931
SMILES:
COc1cc(ccc1Nc1ncc(Cl)c(Oc2cccc(NC(=O)C=C)c2)n1)N1CCOCC1
: