Target
Epidermal growth factor receptor [T790M,L858R]
Ligand
BDBM149438
Substrate
Meas. Tech.
Omnia Assay Protocol for Potency Assessment Against EGFR (WT) and EGFR (T790M/L858R) Active Enzymes
IC50
5.50±n/a nM
Citation
 Lee, KNiu, DPetter, RCBaevsky, MFSingh, J Heterocyclic compounds and uses thereof US Patent  US10434101 Publication Date 10/8/2019 
Target
Name:
Epidermal growth factor receptor [T790M,L858R]
Synonyms:
EGFR EGFR_HUMAN ERBB1 Epidermal growth factor receptor (EGFR)(T790M/L858R) Epidermal growth factor receptor (T790M, L858R) Epidermal growth factor receptor(L858R, T790M) | HER1
Type:
Mol. Mass.:
134353.72
Organism:
Homo sapiens (Human)
Description:
P00533[T790M,L858R]
Residue:
1210
  
Inhibitor
Name:
BDBM149438
Synonyms:
US10434101, Compound I-40 US8975249, I-40
Type:
Small organic molecule
Emp. Form.:
C26H28BrN7O3
Mol. Mass.:
566.45
SMILES:
COc1cc(ccc1Nc1ncc(Br)c(Nc2cccc(NC(=O)C=C)c2)n1)N1CCN(CC1)C(C)=O
: