Target
N-formyl peptide receptor 2
Ligand
BDBM414452
Substrate
Meas. Tech.
FLIPR
EC50
679±n/a nM
Citation
 Viswanath, VBeard, RLDonello, JEHsia, E Use of agonists of formyl peptide receptor 2 for treating dermatological diseases US Patent  US10434112 Publication Date 10/8/2019 
Target
Name:
N-formyl peptide receptor 2
Synonyms:
ALXR, FPRL1, FPR2 FPR2 FPRH1 Formyl Peptide Receptor-Like 1 LXA4 receptor Lipoxin A4 receptor RFP | hFPRL
Type:
G Protein-Coupled Receptor (GPCR)
Mol. Mass.:
38968.35
Organism:
Homo sapiens (Human)
Description:
P25090
Residue:
351
  
Inhibitor
Name:
BDBM414452
Synonyms:
N-(4-bromophenyl)-2-(2,4-dioxo-1,3- diazaspiro[4.6]undec-3-yl)acetamide | US10434112, Table 3.8
Type:
Small organic molecule
Emp. Form.:
C16H19BrN4O3
Mol. Mass.:
395.251
SMILES:
Brc1ccc(NC(=O)NN2C(=O)NC3(CCCCCC3)C2=O)cc1
: