Target
N-formyl peptide receptor 2
Ligand
BDBM350543
Substrate
Meas. Tech.
FLIPR
EC50
31000±n/a nM
Citation
 Viswanath, VBeard, RLDonello, JEHsia, E Use of agonists of formyl peptide receptor 2 for treating dermatological diseases US Patent  US10434112 Publication Date 10/8/2019 
Target
Name:
N-formyl peptide receptor 2
Synonyms:
ALXR, FPRL1, FPR2 FPR2 FPRH1 Formyl Peptide Receptor-Like 1 LXA4 receptor Lipoxin A4 receptor RFP | hFPRL
Type:
G Protein-Coupled Receptor (GPCR)
Mol. Mass.:
38968.35
Organism:
Homo sapiens (Human)
Description:
P25090
Residue:
351
  
Inhibitor
Name:
BDBM350543
Synonyms:
(2S,3S)-2-{[(4-bromo-2- fluorophenyl)carbamoyl]amino}- 3-methylpentanoic acid US10434112, Compound 5 | US10799518, Compound 5
Type:
Small organic molecule
Emp. Form.:
C13H16BrFN2O3
Mol. Mass.:
347.18
SMILES:
CC[C@H](C)[C@H](NC(=O)Nc1ccc(Br)cc1F)C(O)=O
: