Target
N-formyl peptide receptor 2
Ligand
BDBM350564
Substrate
Meas. Tech.
FLIPR
EC50
4.80±n/a nM
Citation
 Viswanath, VBeard, RLDonello, JEHsia, E Use of agonists of formyl peptide receptor 2 for treating dermatological diseases US Patent  US10434112 Publication Date 10/8/2019 
Target
Name:
N-formyl peptide receptor 2
Synonyms:
ALXR, FPRL1, FPR2 FPR2 FPRH1 Formyl Peptide Receptor-Like 1 LXA4 receptor Lipoxin A4 receptor RFP | hFPRL
Type:
G Protein-Coupled Receptor (GPCR)
Mol. Mass.:
38968.35
Organism:
Homo sapiens (Human)
Description:
P25090
Residue:
351
  
Inhibitor
Name:
BDBM350564
Synonyms:
N-(4-bromophenyl) spiro[bicyclo[2.2.1]heptane- 7,1'-cyclopropane]-5-ene-2,3- dicarboxamide US10434112, Compound 26
Type:
Small organic molecule
Emp. Form.:
C17H17BrN2O2
Mol. Mass.:
361.233
SMILES:
NC(=O)C1C2C=CC(C1C(=O)Nc1ccc(Br)cc1)C21CC1
: