Target
N-formyl peptide receptor 2
Ligand
BDBM350624
Substrate
Meas. Tech.
FLIPR
EC50
13.3±n/a nM
Citation
 Viswanath, VBeard, RLDonello, JEHsia, E Use of agonists of formyl peptide receptor 2 for treating dermatological diseases US Patent  US10434112 Publication Date 10/8/2019 
Target
Name:
N-formyl peptide receptor 2
Synonyms:
ALXR, FPRL1, FPR2 FPR2 FPRH1 Formyl Peptide Receptor-Like 1 LXA4 receptor Lipoxin A4 receptor RFP | hFPRL
Type:
G Protein-Coupled Receptor (GPCR)
Mol. Mass.:
38968.35
Organism:
Homo sapiens (Human)
Description:
P25090
Residue:
351
  
Inhibitor
Name:
BDBM350624
Synonyms:
1-(4-bromophenyl)-3-{-[2-(4- hydroxyphenyl)ethyl]-4- methyl-2,5-dioxoimidazolidin- 1-yl}urea US10434112, Compound 86 | US10799518, Compound 86
Type:
Small organic molecule
Emp. Form.:
C19H19BrN4O4
Mol. Mass.:
447.283
SMILES:
CC1(CCc2ccc(O)cc2)NC(=O)N(NC(=O)Nc2ccc(Br)cc2)C1=O
: