Target
N-formyl peptide receptor 2
Ligand
BDBM350643
Substrate
Meas. Tech.
FLIPR
EC50
0.950±n/a nM
Citation
 Viswanath, VBeard, RLDonello, JEHsia, E Use of agonists of formyl peptide receptor 2 for treating dermatological diseases US Patent  US10434112 Publication Date 10/8/2019 
Target
Name:
N-formyl peptide receptor 2
Synonyms:
ALXR, FPRL1, FPR2 FPR2 FPRH1 Formyl Peptide Receptor-Like 1 LXA4 receptor Lipoxin A4 receptor RFP | hFPRL
Type:
G Protein-Coupled Receptor (GPCR)
Mol. Mass.:
38968.35
Organism:
Homo sapiens (Human)
Description:
P25090
Residue:
351
  
Inhibitor
Name:
BDBM350643
Synonyms:
US10208071, Compound 105 US10799518, Compound 105 | ethyl hydrogen ({[(2S)-2-{[(4- bromophenyl)carbamoyl]amino}- 4-methylpentanoyl]amino} methyl)phosphonate
Type:
Small organic molecule
Emp. Form.:
C16H25BrN3O5P
Mol. Mass.:
450.265
SMILES:
CCOP(O)(=O)CNC(=O)[C@H](CC(C)C)NC(=O)Nc1ccc(Br)cc1
: