Target
N-formyl peptide receptor 2
Ligand
BDBM350678
Substrate
Meas. Tech.
FLIPR
EC50
10.3±n/a nM
Citation
 Viswanath, VBeard, RLDonello, JEHsia, E Use of agonists of formyl peptide receptor 2 for treating dermatological diseases US Patent  US10434112 Publication Date 10/8/2019 
Target
Name:
N-formyl peptide receptor 2
Synonyms:
ALXR, FPRL1, FPR2 FPR2 FPRH1 Formyl Peptide Receptor-Like 1 LXA4 receptor Lipoxin A4 receptor RFP | hFPRL
Type:
G Protein-Coupled Receptor (GPCR)
Mol. Mass.:
38968.35
Organism:
Homo sapiens (Human)
Description:
P25090
Residue:
351
  
Inhibitor
Name:
BDBM350678
Synonyms:
US10208071, Compound 141 US10799518, Compound 141 | methyl 2-[2-(1-{[(4- bromophenyl)carbamoyl]amino}- 4-ethyl-2,5- dioxoimidazolidin-4- yl)ethyl]benzoate
Type:
Small organic molecule
Emp. Form.:
C22H23BrN4O5
Mol. Mass.:
503.346
SMILES:
CCC1(CCc2ccccc2C(=O)OC)NC(=O)N(NC(=O)Nc2ccc(Br)cc2)C1=O
: