Target
N-formyl peptide receptor 2
Ligand
BDBM350684
Substrate
Meas. Tech.
FLIPR
EC50
3.90±n/a nM
Citation
 Viswanath, VBeard, RLDonello, JEHsia, E Use of agonists of formyl peptide receptor 2 for treating dermatological diseases US Patent  US10434112 Publication Date 10/8/2019 
Target
Name:
N-formyl peptide receptor 2
Synonyms:
ALXR, FPRL1, FPR2 FPR2 FPRH1 Formyl Peptide Receptor-Like 1 LXA4 receptor Lipoxin A4 receptor RFP | hFPRL
Type:
G Protein-Coupled Receptor (GPCR)
Mol. Mass.:
38968.35
Organism:
Homo sapiens (Human)
Description:
P25090
Residue:
351
  
Inhibitor
Name:
BDBM350684
Synonyms:
3-({[1-{[(4- bromophenyl)carbamoyl]amino}- 2,5-dioxo-4-(propan-2- yl)imidazolidin-4- yl]acetyl}amino)propanoic acid US10434112, Compound 147 | US10799518, Compound 147
Type:
Small organic molecule
Emp. Form.:
C18H22BrN5O6
Mol. Mass.:
484.301
SMILES:
CC(C)C1(CC(=O)NCCC(O)=O)NC(=O)N(NC(=O)Nc2ccc(Br)cc2)C1=O
: