Target
N-formyl peptide receptor 2
Ligand
BDBM350689
Substrate
Meas. Tech.
FLIPR
EC50
11.0±n/a nM
Citation
 Viswanath, VBeard, RLDonello, JEHsia, E Use of agonists of formyl peptide receptor 2 for treating dermatological diseases US Patent  US10434112 Publication Date 10/8/2019 
Target
Name:
N-formyl peptide receptor 2
Synonyms:
ALXR, FPRL1, FPR2 FPR2 FPRH1 Formyl Peptide Receptor-Like 1 LXA4 receptor Lipoxin A4 receptor RFP | hFPRL
Type:
G Protein-Coupled Receptor (GPCR)
Mol. Mass.:
38968.35
Organism:
Homo sapiens (Human)
Description:
P25090
Residue:
351
  
Inhibitor
Name:
BDBM350689
Synonyms:
US10208071, Compound 152 US10799518, Compound 152 | diethyl [2-({[1-{[(4- bromophenyl)carbamoyl]amino}- 2,5-dioxo-4-(propan-2- yl)imidazolidin-4- yl]acetyl}amino)ethyl] phosphonate
Type:
Small organic molecule
Emp. Form.:
C21H31BrN5O7P
Mol. Mass.:
576.378
SMILES:
CCOP(=O)(CCNC(=O)CC1(NC(=O)N(NC(=O)Nc2ccc(Br)cc2)C1=O)C(C)C)OCC
: