Target
Tyrosine-protein kinase JAK1 [837-1142]
Ligand
BDBM380063
Substrate
Meas. Tech.
In Vitro JAK Kinase Assay
IC50
<300±n/a nM
Citation
 Li, YZhuo, JQian, DMei, S Bipyrazole derivatives as JAK inhibitors US Patent  US10435392 Publication Date 10/8/2019 
Target
Name:
Tyrosine-protein kinase JAK1 [837-1142]
Synonyms:
JAK1 JAK1A JAK1_HUMAN Tyrosine-protein kinase JAK1 (837-1142) | Tyrosine-protein kinase JAK1 (aa 837-1142)
Type:
Mol. Mass.:
35230.04
Organism:
Homo sapiens (Human)
Description:
P23458[837-1142]
Residue:
306
  
Inhibitor
Name:
BDBM380063
Synonyms:
5-[3-(Cyanomethyl)-3-(3′-methyl-1H,1′H-4,4′-bipyrazol-1-yl)azetidin-1-yl]-N-isopropylpyrazine-2-carboxamide trifluoroacetate US11591318, Example 3 | US9926301, Example 2
Type:
Small organic molecule
Emp. Form.:
C20H23N9O
Mol. Mass.:
405.4563
SMILES:
CC(C)NC(=O)c1cnc(cn1)N1CC(CC#N)(C1)n1cc(cn1)-c1c[nH]nc1C
: