Target
Interleukin-1 receptor-associated kinase 4
Ligand
BDBM414458
Substrate
Meas. Tech.
IRAK4 Kinase Assay
IC50
10.00±n/a nM
Citation
 Bothe, USiebeneicher, HSchmidt, NGünther, JSteuber, HBömer, ULange, MNubbemeyer, RRay, NCSavy, P 2-substituted indazoles, methods for producing same, pharmaceutical preparations that contain same, and use of same to produce drugs US Patent  US10435396 Publication Date 10/8/2019 
Target
Name:
Interleukin-1 receptor-associated kinase 4
Synonyms:
IRAK-4 IRAK4_HUMAN Interleukin-1 receptor-associated kinase 4 (IRAK4) | Renal carcinoma antigen NY-REN-64
Type:
Protein
Mol. Mass.:
51519.08
Organism:
Homo sapiens (Human)
Description:
Q9NWZ3
Residue:
460
  
Inhibitor
Name:
BDBM414458
Synonyms:
N-[6-Methoxy-2-(tetrahydrofuran-3-yl)-2H-indazol-5-yl]-6-(trifluoromethyl)pyridine-2-carboxamide | US10435396, Example 29
Type:
Small organic molecule
Emp. Form.:
C19H17F3N4O3
Mol. Mass.:
406.3585
SMILES:
COc1cc2nn(cc2cc1NC(=O)c1cccc(n1)C(F)(F)F)C1CCOC1
: