Target
Phosphatidylinositol 4-kinase beta
Ligand
BDBM295029
Substrate
Meas. Tech.
Kinase Glo Luminescent Kinase Assay (Kglo) for PI 3-Kinase Alpha (A), PI 3-Kinase Beta (B), Vps34 (C), PI 4-Kinase Beta (D)
pH
7.5±n/a
Temperature
298.15±n/a K
IC50
1950±n/a nM
Comments
extracted
Citation
 Bellenie, BRBloomfield, GCBruce, ICulshaw, AJHall, ECHollingworth, GJNeef, JSpendiff, MWatson, SJ Amino pyridine derivatives as phosphatidylinositol 3-kinase inhibitors US Patent  US10112926 Publication Date 10/30/2018 
Target
Name:
Phosphatidylinositol 4-kinase beta
Synonyms:
NPIK PI4K-beta PI4KB PI4Kbeta PIK4CB Phosphatidylinositol 4-kinase, PI4K | PtdIns 4-kinase beta
Type:
Protein
Mol. Mass.:
91373.30
Organism:
Homo sapiens (Human)
Description:
Residue:
816
  
Inhibitor
Name:
BDBM295029
Synonyms:
3-{6-Amino-5-[1-(2,2,2-trifluoro-ethyl)-1H-pyrazol-4-yl]-pyridin-3-yl}-4-methyl-N-(6-methyl-pyridin-2-yl)-benzenesulfonamide | US10112926, Example 1
Type:
Small organic molecule
Emp. Form.:
C23H21F3N6O2S
Mol. Mass.:
502.512
SMILES:
Cc1cccc(NS(=O)(=O)c2ccc(C)c(c2)-c2cnc(N)c(c2)-c2cnn(CC(F)(F)F)c2)n1
: