Target
Phosphatidylinositol 4,5-bisphosphate 3-kinase catalytic subunit gamma isoform
Ligand
BDBM295034
Substrate
Meas. Tech.
TR-FRET Adapta Assay for PI 3-Kinase Gamma (E), PI 3-Kinase Delta (F)
pH
7.5±n/a
IC50
8.00±n/a nM
Comments
extracted
Citation
 Bellenie, BRBloomfield, GCBruce, ICulshaw, AJHall, ECHollingworth, GJNeef, JSpendiff, MWatson, SJ Amino pyridine derivatives as phosphatidylinositol 3-kinase inhibitors US Patent  US10112926 Publication Date 10/30/2018 
Target
Name:
Phosphatidylinositol 4,5-bisphosphate 3-kinase catalytic subunit gamma isoform
Synonyms:
PI3-kinase p110 subunit gamma PI3Kgamma PK3CG_HUMAN Phosphatidylinositol 4,5-bisphosphate 3-kinase (PI3K) Phosphatidylinositol 4,5-bisphosphate 3-kinase catalytic subunit gamma (PI3Kgamma) Phosphatidylinositol 4,5-bisphosphate 3-kinase catalytic subunit gamma isoform (PI3K) Phosphatidylinositol-4,5-bisphosphate 3-kinase catalytic subunit gamma isoform Phosphoinositide 3-kinases gamma (PI3K gamma) p120-PI3K
Type:
Enzyme Subunit
Mol. Mass.:
126470.30
Organism:
Homo sapiens (Human)
Description:
P48736
Residue:
1102
  
Inhibitor
Name:
BDBM295034
Synonyms:
US10112926, Example 4.2 | trans 3-(6-Amino-5-(1- (2,2,2-trifluoro ethyl)-1H- pyrazol-4-yl)pyridin-3- yl)-N-(4-hydroxy cyclohexyl)-4-methyl- benzenesulfonamide
Type:
Small organic molecule
Emp. Form.:
C23H26F3N5O3S
Mol. Mass.:
509.544
SMILES:
Cc1ccc(cc1-c1cnc(N)c(c1)-c1cnn(CC(F)(F)F)c1)S(=O)(=O)N[C@H]1CC[C@H](O)CC1
: