Target
Phosphatidylinositol 4,5-bisphosphate 3-kinase catalytic subunit gamma isoform
Ligand
BDBM295059
Substrate
Meas. Tech.
TR-FRET Adapta Assay for PI 3-Kinase Gamma (E), PI 3-Kinase Delta (F)
pH
7.5±n/a
IC50
16.0±n/a nM
Comments
extracted
Citation
 Bellenie, BRBloomfield, GCBruce, ICulshaw, AJHall, ECHollingworth, GJNeef, JSpendiff, MWatson, SJ Amino pyridine derivatives as phosphatidylinositol 3-kinase inhibitors US Patent  US10112926 Publication Date 10/30/2018 
Target
Name:
Phosphatidylinositol 4,5-bisphosphate 3-kinase catalytic subunit gamma isoform
Synonyms:
PI3-kinase p110 subunit gamma PI3Kgamma PK3CG_HUMAN Phosphatidylinositol 4,5-bisphosphate 3-kinase (PI3K) Phosphatidylinositol 4,5-bisphosphate 3-kinase catalytic subunit gamma (PI3Kgamma) Phosphatidylinositol 4,5-bisphosphate 3-kinase catalytic subunit gamma isoform (PI3K) Phosphatidylinositol-4,5-bisphosphate 3-kinase catalytic subunit gamma isoform Phosphoinositide 3-kinases gamma (PI3K gamma) p120-PI3K
Type:
Enzyme Subunit
Mol. Mass.:
126470.30
Organism:
Homo sapiens (Human)
Description:
P48736
Residue:
1102
  
Inhibitor
Name:
BDBM295059
Synonyms:
3-[6-Amino-5-(2-methyl-oxazol-5-yl)-pyridin-3-yl]-N-(3-hydroxy-3-methyl-butyl)-4-methyl-benzenesulfonamide, hydrochloride salt | US10112926, Example 13
Type:
Small organic molecule
Emp. Form.:
C21H26N4O4S
Mol. Mass.:
430.521
SMILES:
Cc1ncc(o1)-c1cc(cnc1N)-c1cc(ccc1C)S(=O)(=O)NCCC(C)(C)O
: