Target
Phosphatidylinositol 4-kinase beta
Ligand
BDBM295066
Substrate
Meas. Tech.
Kinase Glo Luminescent Kinase Assay (Kglo) for PI 3-Kinase Alpha (A), PI 3-Kinase Beta (B), Vps34 (C), PI 4-Kinase Beta (D)
pH
7.5±n/a
Temperature
298.15±n/a K
IC50
4000±n/a nM
Comments
extracted
Citation
 Bellenie, BRBloomfield, GCBruce, ICulshaw, AJHall, ECHollingworth, GJNeef, JSpendiff, MWatson, SJ Amino pyridine derivatives as phosphatidylinositol 3-kinase inhibitors US Patent  US10112926 Publication Date 10/30/2018 
Target
Name:
Phosphatidylinositol 4-kinase beta
Synonyms:
NPIK PI4K-beta PI4KB PI4Kbeta PIK4CB Phosphatidylinositol 4-kinase, PI4K | PtdIns 4-kinase beta
Type:
Protein
Mol. Mass.:
91373.30
Organism:
Homo sapiens (Human)
Description:
Residue:
816
  
Inhibitor
Name:
BDBM295066
Synonyms:
5-(5-(6-oxa-2- azaspiro[3.4]octan-2- ylsulfonyl)-2- methylphenyl)-3-(3- methylisoxazol-5- yl)pyridin-2-amine trifluoroacetic acid salt | US10112926, Example 19.1
Type:
Small organic molecule
Emp. Form.:
C22H24N4O4S
Mol. Mass.:
440.515
SMILES:
Cc1cc(on1)-c1cc(cnc1N)-c1cc(ccc1C)S(=O)(=O)N1CC2(C1)CCOC2
: