Target
Phosphatidylinositol 4-kinase beta
Ligand
BDBM295109
Substrate
Meas. Tech.
Kinase Glo Luminescent Kinase Assay (Kglo) for PI 3-Kinase Alpha (A), PI 3-Kinase Beta (B), Vps34 (C), PI 4-Kinase Beta (D)
pH
7.5±n/a
Temperature
298.15±n/a K
IC50
1200±n/a nM
Comments
extracted
Citation
 Bellenie, BRBloomfield, GCBruce, ICulshaw, AJHall, ECHollingworth, GJNeef, JSpendiff, MWatson, SJ Amino pyridine derivatives as phosphatidylinositol 3-kinase inhibitors US Patent  US10112926 Publication Date 10/30/2018 
Target
Name:
Phosphatidylinositol 4-kinase beta
Synonyms:
NPIK PI4K-beta PI4KB PI4Kbeta PIK4CB Phosphatidylinositol 4-kinase, PI4K | PtdIns 4-kinase beta
Type:
Protein
Mol. Mass.:
91373.30
Organism:
Homo sapiens (Human)
Description:
Residue:
816
  
Inhibitor
Name:
BDBM295109
Synonyms:
3-(6-Amino-5-(3-(tert-butyl)isoxazol-5-yl)pyridin-3-yl)-N-(2-hydroxy-2-methylpropyl)-4-methylbenzenesulfonamide hydrochloride | US10112926, Example 35.5
Type:
Small organic molecule
Emp. Form.:
C23H30N4O4S
Mol. Mass.:
458.574
SMILES:
Cc1ccc(cc1-c1cnc(N)c(c1)-c1cc(no1)C(C)(C)C)S(=O)(=O)NCC(C)(C)O
: