Target
Orexin/Hypocretin receptor type 1
Ligand
BDBM414514
Substrate
Meas. Tech.
FLIPR Ca2+ Flux Assay
IC50
10000±n/a nM
Citation
 Kuduk, SDLiverton, NLuo, Y Oxazole orexin receptor antagonists US Patent  US10435398 Publication Date 10/8/2019 
Target
Name:
Orexin/Hypocretin receptor type 1
Synonyms:
HCRTR1 OX1R_HUMAN Orexin receptor type 1 (OR 1) Orexin receptor type 1 (OX1) Orexin receptor type 1 (OxR1) | Ox1r
Type:
Protein
Mol. Mass.:
47554.50
Organism:
Homo sapiens (Human)
Description:
O43613
Residue:
425
  
Inhibitor
Name:
BDBM414514
Synonyms:
N-(2-hydroxyethyl)-N-(2-(4-(2-hydroxypropan-2-yl)-5-methyloxazol-2-yl)ethyl)-2-(2H-1,2,3-triazol-2-yl)benzamide | US10435398, Example 28
Type:
Small organic molecule
Emp. Form.:
C20H25N5O4
Mol. Mass.:
399.4436
SMILES:
Cc1oc(CCN(CCO)C(=O)c2ccccc2-n2nccn2)nc1C(C)(C)O
: