Target
Epidermal growth factor receptor [T790M,L858R]
Ligand
BDBM414537
Substrate
Meas. Tech.
Wild Type EGFR and Mutant EGFR Kinase Inhibition Test
IC50
4.00±n/a nM
Citation
 Lan, JJin, YZhou, FXie, JShen, SHu, YLiu, WLv, Q 2,4-disubstituted phenylene-1,5-diamine derivatives and applications thereof, and pharmaceutical compositions and pharmaceutically acceptable compositions prepared therefrom US Patent  US10435400 Publication Date 10/8/2019 
Target
Name:
Epidermal growth factor receptor [T790M,L858R]
Synonyms:
EGFR EGFR_HUMAN ERBB1 Epidermal growth factor receptor (EGFR)(T790M/L858R) Epidermal growth factor receptor (T790M, L858R) Epidermal growth factor receptor(L858R, T790M) | HER1
Type:
Mol. Mass.:
134353.72
Organism:
Homo sapiens (Human)
Description:
P00533[T790M,L858R]
Residue:
1210
  
Inhibitor
Name:
BDBM414537
Synonyms:
US10435400, Compound Z-39
Type:
Small organic molecule
Emp. Form.:
C26H30ClN9O2
Mol. Mass.:
536.028
SMILES:
COc1cc(N(C)CCN(C)C)c(NC(=O)C=C)cc1Nc1ncc(Cl)c(n1)-c1cnc2n(C)ncc2c1
: