Target
Mitogen-activated protein kinase kinase kinase kinase 1
Ligand
BDBM414661
Substrate
Meas. Tech.
HPK1 Kinase Binding Assay
Ki
<100±n/a nM
Citation
 Vechorkin, OLiu, KSokolsky, AWang, AYe, HFYe, QYao, W Pyrazolopyridine compounds and uses thereof US Patent  US10435405 Publication Date 10/8/2019 
Target
Name:
Mitogen-activated protein kinase kinase kinase kinase 1
Synonyms:
HPK1 MAP4K1
Type:
PROTEIN
Mol. Mass.:
91316.07
Organism:
Homo sapiens (Human)
Description:
ChEMBL_586597
Residue:
833
  
Inhibitor
Name:
BDBM414661
Synonyms:
US10435405, Example 78 | US10934288, Example 78
Type:
Small organic molecule
Emp. Form.:
C21H22ClN7O
Mol. Mass.:
423.899
SMILES:
CN(C)CC(=O)Nc1cc(C)c(c(Cl)c1)-c1cc2c(n[nH]c2cn1)-c1cnn(C)c1
: