Target
Epithelial discoidin domain-containing receptor 1
Ligand
BDBM371842
Substrate
Meas. Tech.
In Vitro Binding Assay for DDR1
IC50
947±n/a nM
Citation
 Buettelmann, BKocer, BKuhn, BPrunotto, MRichter, HRitter, MRudolph, MSatz, AL Triaza-spirodecanones as DDR1 inhibitors US Patent  US10435407 Publication Date 10/8/2019 
Target
Name:
Epithelial discoidin domain-containing receptor 1
Synonyms:
CAK DDR1_HUMAN Discoidin domain-containing receptor 1 (DDR1) EDDR1 Epithelial discoidin domain receptor 1 (DDR1) Epithelial discoidin domain-containing receptor 1 (DDR1) Mammary carcinoma kinase 10 NTRK4 Protein-tyrosine kinase RTK 6 TRKE | Tyrosine-protein kinase CAK
Type:
Tyrosine-protein kinase
Mol. Mass.:
101130.02
Organism:
Homo sapiens (Human)
Description:
Q08345
Residue:
913
  
Inhibitor
Name:
BDBM371842
Synonyms:
2-(8-(1H-Indazole-5-carbonyl)-4-oxo-1-phenyl-1,3,8-triazaspiro[4.5]decan-3-yl)-N-(3-morpholinophenyl)acetamide US10435407, Example 13
Type:
Small organic molecule
Emp. Form.:
C33H35N7O4
Mol. Mass.:
593.6755
SMILES:
O=C(CN1CN(c2ccccc2)C2(CCN(CC2)C(=O)c2ccc3[nH]ncc3c2)C1=O)Nc1cccc(c1)N1CCOCC1
: