Target
Epithelial discoidin domain-containing receptor 1
Ligand
BDBM414850
Substrate
Meas. Tech.
In Vitro Binding Assay for DDR1
IC50
54.6±n/a nM
Citation
 Buettelmann, BKocer, BKuhn, BPrunotto, MRichter, HRitter, MRudolph, MSatz, AL Triaza-spirodecanones as DDR1 inhibitors US Patent  US10435407 Publication Date 10/8/2019 
Target
Name:
Epithelial discoidin domain-containing receptor 1
Synonyms:
CAK DDR1_HUMAN Discoidin domain-containing receptor 1 (DDR1) EDDR1 Epithelial discoidin domain receptor 1 (DDR1) Epithelial discoidin domain-containing receptor 1 (DDR1) Mammary carcinoma kinase 10 NTRK4 Protein-tyrosine kinase RTK 6 TRKE | Tyrosine-protein kinase CAK
Type:
Tyrosine-protein kinase
Mol. Mass.:
101130.02
Organism:
Homo sapiens (Human)
Description:
Q08345
Residue:
913
  
Inhibitor
Name:
BDBM414850
Synonyms:
2-(8-(Imidazo[1,5-a]pyridine-6-carbonyl)-4-oxo-1-phenyl-1,3,8-triazaspiro[4.5]decan-3-yl)-N-(2,2,2-trifluoroethyl)acetamide | US10435407, Example 21
Type:
Small organic molecule
Emp. Form.:
C25H25F3N6O3
Mol. Mass.:
514.4996
SMILES:
FC(F)(F)CNC(=O)CN1CN(c2ccccc2)C2(CCN(CC2)C(=O)c2ccc3cncn3c2)C1=O
: