Target
Epithelial discoidin domain-containing receptor 1
Ligand
BDBM371940
Substrate
Meas. Tech.
In Vitro Binding Assay for DDR1
IC50
312±n/a nM
Citation
 Buettelmann, BKocer, BKuhn, BPrunotto, MRichter, HRitter, MRudolph, MSatz, AL Triaza-spirodecanones as DDR1 inhibitors US Patent  US10435407 Publication Date 10/8/2019 
Target
Name:
Epithelial discoidin domain-containing receptor 1
Synonyms:
CAK DDR1_HUMAN Discoidin domain-containing receptor 1 (DDR1) EDDR1 Epithelial discoidin domain receptor 1 (DDR1) Epithelial discoidin domain-containing receptor 1 (DDR1) Mammary carcinoma kinase 10 NTRK4 Protein-tyrosine kinase RTK 6 TRKE | Tyrosine-protein kinase CAK
Type:
Tyrosine-protein kinase
Mol. Mass.:
101130.02
Organism:
Homo sapiens (Human)
Description:
Q08345
Residue:
913
  
Inhibitor
Name:
BDBM371940
Synonyms:
8-(1H-Indazole-5-carbonyl)-3-[(3-methyl-1,2,4-oxadiazol-5-yl)methyl]-1-phenyl-1,3,8-triazaspiro[4.5]decan-4-one US10435407, Example 37
Type:
Small organic molecule
Emp. Form.:
C25H25N7O3
Mol. Mass.:
471.5111
SMILES:
Cc1noc(CN2CN(c3ccccc3)C3(CCN(CC3)C(=O)c3ccc4[nH]ncc4c3)C2=O)n1
: