Target
Epithelial discoidin domain-containing receptor 1
Ligand
BDBM371962
Substrate
Meas. Tech.
In Vitro Binding Assay for DDR1
IC50
3317±n/a nM
Citation
 Buettelmann, BKocer, BKuhn, BPrunotto, MRichter, HRitter, MRudolph, MSatz, AL Triaza-spirodecanones as DDR1 inhibitors US Patent  US10435407 Publication Date 10/8/2019 
Target
Name:
Epithelial discoidin domain-containing receptor 1
Synonyms:
CAK DDR1_HUMAN Discoidin domain-containing receptor 1 (DDR1) EDDR1 Epithelial discoidin domain receptor 1 (DDR1) Epithelial discoidin domain-containing receptor 1 (DDR1) Mammary carcinoma kinase 10 NTRK4 Protein-tyrosine kinase RTK 6 TRKE | Tyrosine-protein kinase CAK
Type:
Tyrosine-protein kinase
Mol. Mass.:
101130.02
Organism:
Homo sapiens (Human)
Description:
Q08345
Residue:
913
  
Inhibitor
Name:
BDBM371962
Synonyms:
(rac, trans)-2-[8-(1H-Indazole-5-carbonyl)-4-oxo-1-phenyl-1,3,8-triazaspiro[4.5]decan-3-yl]-N-[4-(3-methyl-1,2,4-oxadiazol-5-yl)pyrrolidin-3-yl]acetamide US10435407, Example 42
Type:
Small organic molecule
Emp. Form.:
C30H33N9O4
Mol. Mass.:
583.6409
SMILES:
Cc1noc(n1)[C@@H]1CNC[C@H]1NC(=O)CN1CN(c2ccccc2)C2(CCN(CC2)C(=O)c2ccc3[nH]ncc3c2)C1=O
: