Target
Epithelial discoidin domain-containing receptor 1
Ligand
BDBM372129
Substrate
Meas. Tech.
In Vitro Binding Assay for DDR1
IC50
29.5±n/a nM
Citation
 Buettelmann, BKocer, BKuhn, BPrunotto, MRichter, HRitter, MRudolph, MSatz, AL Triaza-spirodecanones as DDR1 inhibitors US Patent  US10435407 Publication Date 10/8/2019 
Target
Name:
Epithelial discoidin domain-containing receptor 1
Synonyms:
CAK DDR1_HUMAN Discoidin domain-containing receptor 1 (DDR1) EDDR1 Epithelial discoidin domain receptor 1 (DDR1) Epithelial discoidin domain-containing receptor 1 (DDR1) Mammary carcinoma kinase 10 NTRK4 Protein-tyrosine kinase RTK 6 TRKE | Tyrosine-protein kinase CAK
Type:
Tyrosine-protein kinase
Mol. Mass.:
101130.02
Organism:
Homo sapiens (Human)
Description:
Q08345
Residue:
913
  
Inhibitor
Name:
BDBM372129
Synonyms:
8-(1H-Indazole-5-carbonyl)-3-[2-[(3S or 3R)-4-methyl-3-(trifluoromethyl)piperazin-1-yl]-2-oxoethyl]-1-phenyl-1,3,8-triazaspiro[4.5]decan-4-one US10435407, Example 152
Type:
Small organic molecule
Emp. Form.:
C29H32F3N7O3
Mol. Mass.:
583.6047
SMILES:
CN1CCN(C[C@H]1C(F)(F)F)C(=O)CN1CN(c2ccccc2)C2(CCN(CC2)C(=O)c2ccc3[nH]ncc3c2)C1=O
: