Target
Phosphatidylinositol 3-kinase regulatory subunit alpha
Ligand
BDBM272882
Substrate
Meas. Tech.
TBD
Ki
0.056±n/a nM
Citation
 Braun, MGarland, KHanan, EPurkey, HStaben, STHeald, RAKnight, JMacleod, CLu, AWu, GYeap, SK Tricyclic PI3K inhibitor compounds and methods of use US Patent  US10435414 Publication Date 10/8/2019 
Target
Name:
Phosphatidylinositol 3-kinase regulatory subunit alpha
Synonyms:
GRB1 PI3-kinase class I PI3-kinase p85-alpha subunit PI3-kinase subunit p85-alpha PIK3CG/PIK3R1 Phosphatidylinositol 3-kinase 85 kDa regulatory subunit alpha (PI3K alpha) Phosphatidylinositol 3-kinase regulatory subunit alpha (PIK3R1) Phosphatidylinositol 3-kinase regulatory subunit alpha isoform 1 (PI3 Kinase alpha) Phosphatidylinositol 4,5-bisphosphate 3-kinase catalytic subunit alpha isoform (PI3Kalpha) PtdIns-3-kinase p85-alpha p85 alpha
Type:
Protein
Mol. Mass.:
83592.82
Organism:
Homo sapiens (Human)
Description:
P27986
Residue:
724
  
Inhibitor
Name:
BDBM272882
Synonyms:
(S)-2-((1-(2- aminoquinoxalin-6- yl)-8,9-dihydro-7H- 6-oxa-2,9a- diazabenzo[cd]azulen- 4-yl)amino)-2- cyclopropylacetamide US10435414, Compound 187
Type:
Small organic molecule
Emp. Form.:
C23H23N7O2
Mol. Mass.:
429.4744
SMILES:
NC(=O)[C@@H](Nc1cc2OCCCn3c(nc(c1)c23)-c1ccc2nc(N)cnc2c1)C1CC1
: