Target
Tyrosine-protein kinase JAK2
Ligand
BDBM230093
Substrate
Meas. Tech.
Jak2 Tyrosine Kinase Assay
IC50
1900±n/a nM
Citation
 Batt, DGBertrand, MBDe Lucca, GVGalella, MAKo, SSLangevine, CMLiu, QShi, QSrivastava, ASTino, JAWatterson, SH Substituted tetrahydrocarbazole and carbazole carboxamide compounds US Patent  US10435415 Publication Date 10/8/2019 
Target
Name:
Tyrosine-protein kinase JAK2
Synonyms:
JAK-2 JAK2_HUMAN Janus kinase 2 (JAK2) | Janus kinase 2 (a protein tyrosine kinase)
Type:
Protein
Mol. Mass.:
130684.68
Organism:
Homo sapiens (Human)
Description:
O60674
Residue:
1132
  
Inhibitor
Name:
BDBM230093
Synonyms:
US10106559, Example 16 US9334290, 15 | US9850258, Example 16
Type:
Small organic molecule
Emp. Form.:
C33H26FN5O4
Mol. Mass.:
575.589
SMILES:
Cc1c(cccc1-n1c(=O)n(C)c2c(F)cccc2c1=O)-c1c(cc(C(N)=O)c2[nH]c3cc(ccc3c12)C(C)(C)O)C#N
: