Target
Tyrosine-protein kinase JAK2
Ligand
BDBM230108
Substrate
Meas. Tech.
Jak2 Tyrosine Kinase Assay
IC50
800±n/a nM
Citation
 Batt, DGBertrand, MBDe Lucca, GVGalella, MAKo, SSLangevine, CMLiu, QShi, QSrivastava, ASTino, JAWatterson, SH Substituted tetrahydrocarbazole and carbazole carboxamide compounds US Patent  US10435415 Publication Date 10/8/2019 
Target
Name:
Tyrosine-protein kinase JAK2
Synonyms:
JAK-2 JAK2_HUMAN Janus kinase 2 (JAK2) | Janus kinase 2 (a protein tyrosine kinase)
Type:
Protein
Mol. Mass.:
130684.68
Organism:
Homo sapiens (Human)
Description:
O60674
Residue:
1132
  
Inhibitor
Name:
BDBM230108
Synonyms:
US10106559, Example 36 US9334290, 34 US9850258, Example 36
Type:
Small organic molecule
Emp. Form.:
C31H24ClFN4O4
Mol. Mass.:
570.998
SMILES:
Cc1c(cccc1-n1c(=O)cc2c(F)cccn2c1=O)-c1c(Cl)cc(C(N)=O)c2[nH]c3cc(ccc3c12)C(C)(C)O
: