Target
Tyrosine-protein kinase JAK2
Ligand
BDBM230110
Substrate
Meas. Tech.
Jak2 Tyrosine Kinase Assay
IC50
630±n/a nM
Citation
 Batt, DGBertrand, MBDe Lucca, GVGalella, MAKo, SSLangevine, CMLiu, QShi, QSrivastava, ASTino, JAWatterson, SH Substituted tetrahydrocarbazole and carbazole carboxamide compounds US Patent  US10435415 Publication Date 10/8/2019 
Target
Name:
Tyrosine-protein kinase JAK2
Synonyms:
JAK-2 JAK2_HUMAN Janus kinase 2 (JAK2) | Janus kinase 2 (a protein tyrosine kinase)
Type:
Protein
Mol. Mass.:
130684.68
Organism:
Homo sapiens (Human)
Description:
O60674
Residue:
1132
  
Inhibitor
Name:
BDBM230110
Synonyms:
US10106559, Example 37 US9334290, 37 | US9850258, Example 37
Type:
Small organic molecule
Emp. Form.:
C32H27ClN4O5
Mol. Mass.:
583.034
SMILES:
COc1cccn2c1cc(=O)n(-c1cccc(c1C)-c1c(Cl)cc(C(N)=O)c3[nH]c4cc(ccc4c13)C(C)(C)O)c2=O
: