Target
Tyrosine-protein kinase BTK
Ligand
BDBM230137
Substrate
Meas. Tech.
Human Recombinant Btk Enzyme Assay
IC50
0.560±n/a nM
Citation
 Batt, DGBertrand, MBDe Lucca, GVGalella, MAKo, SSLangevine, CMLiu, QShi, QSrivastava, ASTino, JAWatterson, SH Substituted tetrahydrocarbazole and carbazole carboxamide compounds US Patent  US10435415 Publication Date 10/8/2019 
Target
Name:
Tyrosine-protein kinase BTK
Synonyms:
AGMX1 Agammaglobulinaemia tyrosine kinase B cell progenitor kinase BPK BTK_HUMAN Tyrosine Kinase BTK Tyrosine-protein kinase BTK (BTK)
Type:
Enzyme
Mol. Mass.:
76289.95
Organism:
Homo sapiens (Human)
Description:
Q06187
Residue:
659
  
Inhibitor
Name:
BDBM230137
Synonyms:
US10106559, Example 69 US9334290, 68 US9850258, Example 69
Type:
Small organic molecule
Emp. Form.:
C31H28F2N4O4
Mol. Mass.:
558.5752
SMILES:
Cc1c(cccc1-n1c(=O)cc2c(F)cccn2c1=O)-c1c(F)cc(C(N)=O)c2[nH]c3C[C@H](CCc3c12)C(C)(C)O
: