Target
Dipeptidyl peptidase 1
Ligand
BDBM201014
Substrate
Meas. Tech.
Inhibition of Human DPPI (Cathepsin C)
IC50
0.300±n/a nM
Citation
 Vintonyak, VGrauert, MGrundl, MPautsch, A Substituted spirocycles US Patent  USRE47636 Publication Date 10/8/2019 
Target
Name:
Dipeptidyl peptidase 1
Synonyms:
CATC_HUMAN CTSC Cathepsin J Dipeptidyl peptidase 1 (DPPI) Dipeptidyl peptidase I (DPPI)
Type:
Enzyme
Mol. Mass.:
51857.28
Organism:
Homo sapiens (Human)
Description:
P53634
Residue:
463
  
Inhibitor
Name:
BDBM201014
Synonyms:
US9540373, 3 USRE47636, Example 3
Type:
Small organic molecule
Emp. Form.:
C28H30FN5O2
Mol. Mass.:
487.5685
SMILES:
Fc1cc(ccc1C[C@H](NC(=O)[C@H]1N[C@@H]2CC[C@H]1C2)C#N)-c1ccc2NC(=O)C3(CCNCC3)c2c1
: