Target
Nuclear receptor ROR-gamma
Ligand
BDBM189910
Substrate
Meas. Tech.
TR-FRET
IC50
5.70±n/a nM
Citation
 Schnute, MEFlick, ACJones, PKaila, NMente, SRTrzupek, JDVazquez, MLWennerstal, GMXing, LZamaratski, EZhang, LUnwalla, RJ Methyl- and trifluromethyl-substituted pyrrolopyridine modulators of RORC2 and methods of use thereof US Patent  US10426135 Publication Date 10/1/2019 
Target
Name:
Nuclear receptor ROR-gamma
Synonyms:
NR1F3 Nuclear receptor ROR-gamma (RORC) RAR-related orphan receptor C (RORc) RORG RZRG Retinoid-related orphan receptor-gamma (RORc)
Type:
Enzyme Catalytic Domain
Mol. Mass.:
58218.40
Organism:
Homo sapiens (Human)
Description:
P51449
Residue:
518
  
Inhibitor
Name:
BDBM189910
Synonyms:
US10227346, Example 34 US9670201, 34 3-cyano-N-(3-(1-(2,3-dihydro-1H-indene-4-carbonyl)piperidin-4-yl)-1,4-dimethyl-1H-pyrrolo[2,3-b]pyridin-5-yl)benzamide | US9920054, Example 34
Type:
Small organic molecule
Emp. Form.:
C32H31N5O2
Mol. Mass.:
517.6208
SMILES:
Cc1c(NC(=O)c2cccc(c2)C#N)cnc2n(C)cc(C3CCN(CC3)C(=O)c3cccc4CCCc34)c12
: