Target
Nuclear receptor ROR-gamma
Ligand
BDBM190310
Substrate
Meas. Tech.
TR-FRET
IC50
9.70±n/a nM
Citation
 Schnute, MEFlick, ACJones, PKaila, NMente, SRTrzupek, JDVazquez, MLWennerstal, GMXing, LZamaratski, EZhang, LUnwalla, RJ Methyl- and trifluromethyl-substituted pyrrolopyridine modulators of RORC2 and methods of use thereof US Patent  US10426135 Publication Date 10/1/2019 
Target
Name:
Nuclear receptor ROR-gamma
Synonyms:
NR1F3 Nuclear receptor ROR-gamma (RORC) RAR-related orphan receptor C (RORc) RORG RZRG Retinoid-related orphan receptor-gamma (RORc)
Type:
Enzyme Catalytic Domain
Mol. Mass.:
58218.40
Organism:
Homo sapiens (Human)
Description:
P51449
Residue:
518
  
Inhibitor
Name:
BDBM190310
Synonyms:
US10227346, Example 68 US9670201, 68 3-cyano-N-(3-((R)-2,2-dimethyl-1-((R)-2,3,3-trimethylbutanoyl)piperidin-4-yl)-1,4-dimethyl-1H-pyrrolo[2,3-b]pyridin-5-yl)benzamide | US9920054, Example 68
Type:
Small organic molecule
Emp. Form.:
C31H39N5O2
Mol. Mass.:
513.6737
SMILES:
C[C@@H](C(=O)N1CC[C@H](CC1(C)C)c1cn(C)c2ncc(NC(=O)c3cccc(c3)C#N)c(C)c12)C(C)(C)C
: