Target
Nuclear receptor ROR-gamma
Ligand
BDBM190346
Substrate
Meas. Tech.
TR-FRET
IC50
2.70±n/a nM
Citation
 Schnute, MEFlick, ACJones, PKaila, NMente, SRTrzupek, JDVazquez, MLWennerstal, GMXing, LZamaratski, EZhang, LUnwalla, RJ Methyl- and trifluromethyl-substituted pyrrolopyridine modulators of RORC2 and methods of use thereof US Patent  US10426135 Publication Date 10/1/2019 
Target
Name:
Nuclear receptor ROR-gamma
Synonyms:
NR1F3 Nuclear receptor ROR-gamma (RORC) RAR-related orphan receptor C (RORc) RORG RZRG Retinoid-related orphan receptor-gamma (RORc)
Type:
Enzyme Catalytic Domain
Mol. Mass.:
58218.40
Organism:
Homo sapiens (Human)
Description:
P51449
Residue:
518
  
Inhibitor
Name:
BDBM190346
Synonyms:
US10227346, Example 95 US9670201, 95 3-cyano-N-(3-((2S,4R)-1-isobutyryl-2-methylpiperidin-4-yl)-1-methyl-4-(trifluoromethyl)-1H-pyrrolo[2,3-b]pyridin-5-yl)benzamide | US9920054, Example 95
Type:
Small organic molecule
Emp. Form.:
C27H28F3N5O2
Mol. Mass.:
511.5387
SMILES:
CC(C)C(=O)N1CC[C@H](C[C@@H]1C)c1cn(C)c2ncc(NC(=O)c3cccc(c3)C#N)c(c12)C(F)(F)F
: