Target
Nuclear receptor ROR-gamma
Ligand
BDBM190350
Substrate
Meas. Tech.
TR-FRET
IC50
18.6±n/a nM
Citation
 Schnute, MEFlick, ACJones, PKaila, NMente, SRTrzupek, JDVazquez, MLWennerstal, GMXing, LZamaratski, EZhang, LUnwalla, RJ Methyl- and trifluromethyl-substituted pyrrolopyridine modulators of RORC2 and methods of use thereof US Patent  US10426135 Publication Date 10/1/2019 
Target
Name:
Nuclear receptor ROR-gamma
Synonyms:
NR1F3 Nuclear receptor ROR-gamma (RORC) RAR-related orphan receptor C (RORc) RORG RZRG Retinoid-related orphan receptor-gamma (RORc)
Type:
Enzyme Catalytic Domain
Mol. Mass.:
58218.40
Organism:
Homo sapiens (Human)
Description:
P51449
Residue:
518
  
Inhibitor
Name:
BDBM190350
Synonyms:
US10227346, Example 97 US9670201, 97 rel-3-cyano-N-(3-((2S,4S,5S)-1-(cyclopentanecarbonyl)-2,5-dimethylpiperidin-4-yl)-1,4-dimethyl-1H-pyrrolo[2,3-b]pyridin-5-yl)benzamide | US9920054, Example 97
Type:
Small organic molecule
Emp. Form.:
C30H35N5O2
Mol. Mass.:
497.6312
SMILES:
C[C@@H]1CN([C@@H](C)CC1c1cn(C)c2ncc(NC(=O)c3cccc(c3)C#N)c(C)c12)C(=O)C1CCCC1
: