Target
[Pyruvate dehydrogenase (acetyl-transferring)] kinase isozyme 2, mitochondrial
Ligand
BDBM414838
Substrate
Meas. Tech.
Isothermal Titration Calorimetry
Kd
100.0±n/a nM
Citation
 Buchstaller, H Piperidinyl derivatives US Patent  US10428024 Publication Date 10/1/2019 
Target
Name:
[Pyruvate dehydrogenase (acetyl-transferring)] kinase isozyme 2, mitochondrial
Synonyms:
PDHK2 PDK2_HUMAN Pyruvate dehydrogenase kinase isoenzyme 1 (PDK2)
Type:
Enzyme
Mol. Mass.:
46153.78
Organism:
Homo sapiens (Human)
Description:
Q15119
Residue:
407
  
Inhibitor
Name:
BDBM414838
Synonyms:
N-(4-chlorophenyl)-N,3-dimethyl-1-[(2R)-3,3,3-trifluoro-2-hydroxy-2-methylpropanoyl]piperidine-4-carboxamide, Mixture of Diastereomers | US10428024, Compound A9
Type:
Small organic molecule
Emp. Form.:
C18H22ClF3N2O3
Mol. Mass.:
406.827
SMILES:
CC1CN(CCC1C(=O)N(C)c1ccc(Cl)cc1)C(=O)[C@@](C)(O)C(F)(F)F
: