Target
[Pyruvate dehydrogenase (acetyl-transferring)] kinase isozyme 2, mitochondrial
Ligand
BDBM414842
Substrate
Meas. Tech.
Isothermal Titration Calorimetry
Kd
14.0±n/a nM
Citation
 Buchstaller, H Piperidinyl derivatives US Patent  US10428024 Publication Date 10/1/2019 
Target
Name:
[Pyruvate dehydrogenase (acetyl-transferring)] kinase isozyme 2, mitochondrial
Synonyms:
PDHK2 PDK2_HUMAN Pyruvate dehydrogenase kinase isoenzyme 1 (PDK2)
Type:
Enzyme
Mol. Mass.:
46153.78
Organism:
Homo sapiens (Human)
Description:
Q15119
Residue:
407
  
Inhibitor
Name:
BDBM414842
Synonyms:
(3S,4S)—N-(2-fluoro-4-methylphenyl)-N,3-dimethyl-1-[(2R)-3,3,3-trifluoro-2-hydroxy-2-methylpropanoyl]piperidine-4-carboxamide | US10428024, Compound A13
Type:
Small organic molecule
Emp. Form.:
C19H24F4N2O3
Mol. Mass.:
404.3991
SMILES:
C[C@@H]1CN(CC[C@@H]1C(=O)N(C)c1ccc(C)cc1F)C(=O)[C@@](C)(O)C(F)(F)F
: